BDBM94076 MLS000723152::N-[[5-[2-(4-fluoroanilino)-2-oxoethyl]sulfanyl-4-phenyl-1,2,4-triazol-3-yl]methyl]adamantane-1-carboxamide::N-[[5-[2-[(4-fluorophenyl)amino]-2-oxidanylidene-ethyl]sulfanyl-4-phenyl-1,2,4-triazol-3-yl]methyl]adamantane-1-carboxamide::N-[[5-[[2-(4-fluoroanilino)-2-keto-ethyl]thio]-4-phenyl-1,2,4-triazol-3-yl]methyl]adamantane-1-carboxamide::N-[[5-[[2-(4-fluoroanilino)-2-oxoethyl]thio]-4-phenyl-1,2,4-triazol-3-yl]methyl]-1-adamantanecarboxamide::SMR000236043::cid_3570682
SMILES [H]C12CC3([H])CC([H])(C1)CC(C2)(C3)C(=O)NCc1nnc(SCC(=O)Nc2ccc(F)cc2)n1-c1ccccc1
InChI Key InChIKey=VMLPLWHFCNSDTF-UHFFFAOYSA-N
Data  1 IC50
  Tab Delimited (TSV)   2D SDfile   Computed 3D by Vconf -m prep SDfile
Find this compound or compounds like it in BindingDB:
Activity Spreadsheet -- Enzyme Inhibition Constant Data from BindingDB
Found 1 hit for monomerid = 94076
TargetNeuropilin-1(Homo sapiens (Human))
Burnham Center For Chemical Genomics
Curated by PubChem BioAssay
LigandPNGBDBM94076(MLS000723152 | N-[[5-[2-(4-fluoroanilino)-2-oxoeth...)
Affinity DataIC50: >9.50E+4nM
In DepthDetails PCBioAssay