BDBM94085 3-(4-ethoxyphenoxy)propanoic acid [2-(2,2-dimethyl-3-oxo-4H-quinoxalin-1-yl)-2-oxoethyl] ester::3-(4-ethoxyphenoxy)propionic acid [2-keto-2-(3-keto-2,2-dimethyl-4H-quinoxalin-1-yl)ethyl] ester::MLS001071089::SMR000707533::[2-(2,2-dimethyl-3-oxidanylidene-4H-quinoxalin-1-yl)-2-oxidanylidene-ethyl] 3-(4-ethoxyphenoxy)propanoate::[2-(2,2-dimethyl-3-oxo-4H-quinoxalin-1-yl)-2-oxoethyl] 3-(4-ethoxyphenoxy)propanoate::cid_24820015
SMILES CCOc1ccc(OCCC(=O)OCC(=O)N2c3ccccc3NC(=O)C2(C)C)cc1
InChI Key InChIKey=SKMMPJCTWUVNKW-UHFFFAOYSA-N
Data  1 IC50
  Tab Delimited (TSV)   2D SDfile   Computed 3D by Vconf -m prep SDfile
Find this compound or compounds like it in BindingDB:
Activity Spreadsheet -- Enzyme Inhibition Constant Data from BindingDB
Found 1 hit for monomerid = 94085
TargetNeuropilin-1(Homo sapiens (Human))
Burnham Center For Chemical Genomics
Curated by PubChem BioAssay
LigandPNGBDBM94085(3-(4-ethoxyphenoxy)propanoic acid [2-(2,2-dimethyl...)
Affinity DataIC50: >9.50E+4nM
In DepthDetails PCBioAssay