BDBM9418 N-methyl-N-{2-[1-(2-phenylethyl)piperidin-4-yl]ethyl}benzamide hydrochloride::Piperidine Derivative 31
SMILES CN(CCC1CCN(CCc2ccccc2)CC1)C(=O)c1ccccc1
InChI Key InChIKey=ZTLCXUGDRAFEJG-UHFFFAOYSA-N
Data  1 IC50
  Tab Delimited (TSV)   2D SDfile   Computed 3D by Vconf -m prep SDfile
Find this compound or compounds like it in BindingDB:
Activity Spreadsheet -- Enzyme Inhibition Constant Data from BindingDB
Found 1 hit for monomerid = 9418
TargetAcetylcholinesterase(Mus musculus (mouse))
Tsukuba Research Laboratories
LigandPNGBDBM9418(N-methyl-N-{2-[1-(2-phenylethyl)piperidin-4-yl]eth...)
Affinity DataIC50:  1.30E+4nM. Assay description: The cholinesterase assays were performed using colorimetric method reported by Ellman. The amount of a yellow substance formed after incubation was d...
In DepthDetails ArticlePubMed