BDBM94422 2-keto-N-methyl-N-[(1-methylpyrazol-4-yl)methyl]chromene-3-carboxamide::MLS000043434::N-methyl-N-[(1-methyl-1H-pyrazol-4-yl)methyl]-2-oxo-2H-chromene-3-carboxamide::N-methyl-N-[(1-methyl-4-pyrazolyl)methyl]-2-oxo-1-benzopyran-3-carboxamide::N-methyl-N-[(1-methylpyrazol-4-yl)methyl]-2-oxidanylidene-chromene-3-carboxamide::N-methyl-N-[(1-methylpyrazol-4-yl)methyl]-2-oxochromene-3-carboxamide::SMR000020251::cid_753177
SMILES CN(Cc1cnn(C)c1)C(=O)c1cc2ccccc2oc1=O
InChI Key InChIKey=OKUDDNPZIYNWHP-UHFFFAOYSA-N
Data  1 IC50
  Tab Delimited (TSV)   2D SDfile   Computed 3D by Vconf -m prep SDfile
Find this compound or compounds like it in BindingDB:
Activity Spreadsheet -- Enzyme Inhibition Constant Data from BindingDB
Found 1 hit for monomerid = 94422
TargetNeuropilin-1(Homo sapiens (Human))
Burnham Center For Chemical Genomics
Curated by PubChem BioAssay
LigandPNGBDBM94422(2-keto-N-methyl-N-[(1-methylpyrazol-4-yl)methyl]ch...)
Affinity DataIC50: >9.50E+4nM
In DepthDetails PCBioAssay