BDBM94502 3-[6-[(2-chlorobenzyl)amino]-[1,2,4]triazolo[4,3-b]pyridazin-3-yl]-N-[3-(2-furyl)-1-methyl-propyl]propionamide::3-[6-[(2-chlorophenyl)methylamino]-[1,2,4]triazolo[4,3-b]pyridazin-3-yl]-N-[4-(2-furanyl)butan-2-yl]propanamide::3-[6-[(2-chlorophenyl)methylamino]-[1,2,4]triazolo[4,3-b]pyridazin-3-yl]-N-[4-(furan-2-yl)butan-2-yl]propanamide::MLS001095859::SMR000631385::cid_20957053
SMILES CC(CCc1ccco1)NC(=O)CCc1nnc2ccc(NCc3ccccc3Cl)nn12
InChI Key InChIKey=MDIJRBIZLFDPMO-UHFFFAOYSA-N
Data  4 IC50
  Tab Delimited (TSV)   2D SDfile   Computed 3D by Vconf -m prep SDfile
Find this compound or compounds like it in BindingDB:
Activity Spreadsheet -- Enzyme Inhibition Constant Data from BindingDB
Found 4 hits for monomerid = 94502
TargetHepatocyte nuclear factor 4-alpha(Homo sapiens (Human))
The Scripps Research Institute Molecular Screening Center
Curated by PubChem BioAssay
LigandPNGBDBM94502(3-[6-[(2-chlorobenzyl)amino]-[1,2,4]triazolo[4,3-b...)
Affinity DataIC50: >3.98E+4nM
In DepthDetails PCBioAssay
TargetPerilipin-5(Homo sapiens (Human))
The Scripps Research Institute Molecular Screening Center
Curated by PubChem BioAssay
LigandPNGBDBM94502(3-[6-[(2-chlorobenzyl)amino]-[1,2,4]triazolo[4,3-b...)
Affinity DataIC50:  8.98E+3nM
In DepthDetails PCBioAssay
TargetPerilipin-1(Homo sapiens (Human))
The Scripps Research Institute Molecular Screening Center
Curated by PubChem BioAssay
LigandPNGBDBM94502(3-[6-[(2-chlorobenzyl)amino]-[1,2,4]triazolo[4,3-b...)
Affinity DataIC50:  2.03E+3nM
In DepthDetails PCBioAssay
TargetPerilipin-5(Homo sapiens (Human))
The Scripps Research Institute Molecular Screening Center
Curated by PubChem BioAssay
LigandPNGBDBM94502(3-[6-[(2-chlorobenzyl)amino]-[1,2,4]triazolo[4,3-b...)
Affinity DataIC50:  3.74E+3nM
In DepthDetails PCBioAssay