BDBM95410 1-[(E)-1,3-benzodioxol-5-ylmethylideneamino]-2-benzimidazolamine::1-[(E)-1,3-benzodioxol-5-ylmethylideneamino]benzimidazol-2-amine::MLS000559987::N*1*-[1-Benzo[1,3]dioxol-5-yl-meth-(E)-ylidene]-benzoimidazole-1,2-diamine::SMR000439379::[1-[(E)-piperonylideneamino]benzimidazol-2-yl]amine::cid_9630429
SMILES Nc1nc2ccccc2n1\N=C\c1ccc2OCOc2c1
InChI Key InChIKey=LSUDLYVQHRSJJB-CAOOACKPSA-N
Data  1 IC50
  Tab Delimited (TSV)   2D SDfile   Computed 3D by Vconf -m prep SDfile
Find this compound or compounds like it in BindingDB:
Activity Spreadsheet -- Enzyme Inhibition Constant Data from BindingDB
Found 1 hit for monomerid = 95410
TargetMitochondrial peptide methionine sulfoxide reductase(Bos taurus)
The Scripps Research Institute Molecular Screening Center
Curated by PubChem BioAssay
LigandPNGBDBM95410(1-[(E)-1,3-benzodioxol-5-ylmethylideneamino]-2-ben...)
Affinity DataIC50:  4.56E+4nM
In DepthDetails PCBioAssay