BDBM966 5PhBuCOOH deriv.::Statine deriv. 49::Tle-Val-Sta::benzyl N-[(1S)-1-{[(2S,3R,4R)-4-{[(1S)-1-[(1H-1,3-benzodiazol-2-ylmethyl)carbamoyl]-2-methylpropyl]carbamoyl}-4-{[(4-chlorophenyl)methyl]amino}-3-hydroxy-1-phenylbutan-2-yl]carbamoyl}-2,2-dimethylpropyl]carbamate
SMILES CC(C)[C@H](NC(=O)[C@H](NCc1ccc(Cl)cc1)[C@H](O)[C@H](Cc1ccccc1)NC(=O)[C@@H](NC(=O)OCc1ccccc1)C(C)(C)C)C(=O)NCc1nc2ccccc2[nH]1
InChI Key InChIKey=IEDQYRTWHQBMRX-UREOVUFLSA-N
Data  3 KI
  Tab Delimited (TSV)   2D SDfile   Computed 3D by Vconf -m prep SDfile
Find this compound or compounds like it in BindingDB:
Activity Spreadsheet -- Enzyme Inhibition Constant Data from BindingDB
Found 3 hits for monomerid = 966
TargetDimer of Gag-Pol polyprotein [489-587](Human immunodeficiency virus type 1)
Sandoz Forschungsinstitut Ges.M.B.H.
LigandPNGBDBM966(5PhBuCOOH deriv. | Statine deriv. 49 | Tle-Val-Sta...)
Affinity DataKi:  7.5nM. Assay description: Enzymatic activity was measured by following cleavage of the substrate H-Lys-Ala-Arg-Val-Leu-pNph-Glu-Ala-Nle-NH2. Products of the cleavage reaction ...
In DepthDetails ArticlePubMed
TargetGag-Pol polyprotein [489-587](Human immunodeficiency virus type 1)
Sandoz Forschungsinstitut Ges.M.B.H.
Curated by ChEMBL
LigandPNGBDBM966(5PhBuCOOH deriv. | Statine deriv. 49 | Tle-Val-Sta...)
Affinity DataKi:  7.59nM. Assay description: Inhibitory activity was determined against HIV type 1 protease
In DepthDetails ArticlePubMed
TargetDimer of Gag-Pol polyprotein [514-612](Human immunodeficiency virus type 2)
Sandoz Forschungsinstitut Ges.M.B.H.
LigandPNGBDBM966(5PhBuCOOH deriv. | Statine deriv. 49 | Tle-Val-Sta...)
Affinity DataKi:  17nM. Assay description: Enzymatic activity was measured by following cleavage of the substrate H-Lys-Ala-Arg-Val-Leu-pNph-Glu-Ala-Nle-NH2. Products of the cleavage reaction ...
In DepthDetails ArticlePubMed