BDBM96828 (3E)-3-[1-[2-(4-hydroxyphenyl)ethylamino]ethylidene]-2-oxolanone::(3E)-3-[1-[2-(4-hydroxyphenyl)ethylamino]ethylidene]oxolan-2-one::(3E)-3-[1-[2-(4-hydroxyphenyl)ethylamino]ethylidene]tetrahydrofuran-2-one::MLS003107204::SMR001822079::cid_6392533
SMILES CC(NCCc1ccc(O)cc1)=C1CCOC1=O
InChI Key InChIKey=GZHVGMBLHGHIEO-UHFFFAOYSA-N
Data  2 IC50  2 EC50
  Tab Delimited (TSV)   2D SDfile   Computed 3D by Vconf -m prep SDfile
Find this compound or compounds like it in BindingDB:
Activity Spreadsheet -- Enzyme Inhibition Constant Data from BindingDB
Found 2 hits for monomerid = 96828
TargetGuanine nucleotide-binding protein subunit alpha-15(Homo sapiens (Human))
The Scripps Research Institute Molecular Screening Center
Curated by PubChem BioAssay
LigandPNGBDBM96828((3E)-3-[1-[2-(4-hydroxyphenyl)ethylamino]ethyliden...)
Affinity DataEC50: >2.99E+4nM
In DepthDetails PCBioAssay
TargetTrace amine-associated receptor 1(Homo sapiens (Human))
The Scripps Research Institute Molecular Screening Center
Curated by PubChem BioAssay
LigandPNGBDBM96828((3E)-3-[1-[2-(4-hydroxyphenyl)ethylamino]ethyliden...)
Affinity DataEC50:  2.05E+3nM
In DepthDetails PCBioAssay