BDBM97371 ECE Inhibitor, 14
SMILES CC(C)(C)CC(=O)Nc1ccc2n(Cc3ccccc3F)c(cc2c1)C(=O)Nc1cncc(c1)C(=O)Nc1ccc(cc1)S(N)(=O)=O
InChI Key InChIKey=WQNGXFXGZRSDCB-UHFFFAOYSA-N
Data  1 IC50
  Tab Delimited (TSV)   2D SDfile   Computed 3D by Vconf -m prep SDfile
Find this compound or compounds like it in BindingDB:
Activity Spreadsheet -- Enzyme Inhibition Constant Data from BindingDB
Found 1 hit for monomerid = 97371
TargetEndothelin-converting enzyme 1(Rattus norvegicus (Rat))
Bayer Healthcare
LigandPNGBDBM97371(ECE Inhibitor, 14)
Affinity DataIC50:  10nM. Assay description: Inhibition assay using ECE.
In DepthDetails ArticlePubMed