BDBM97475 US8470816, 30
SMILES CN([C@@H]1CCN(CC1c1ccc(Cl)c(Cl)c1)C(=O)C1CCN(CC1)C(C)=O)C(=O)c1ccc(Cl)cc1
InChI Key InChIKey=RPTJPWCOBZLMMD-NRWPOFLRSA-N
Data  3 IC50
  Tab Delimited (TSV)   2D SDfile   Computed 3D by Vconf -m prep SDfile
Find this compound or compounds like it in BindingDB:
Activity Spreadsheet -- Enzyme Inhibition Constant Data from BindingDB
Found 3 hits for monomerid = 97475
TargetSubstance-P receptor(Homo sapiens (Human))
Takeda Pharmaceutical
US Patent
LigandPNGBDBM97475(US8470816, 30)
Affinity DataIC50:  240nMpH: 7.4Assay Description:Radioligan receptor binding inhibitory activity using membrane fraction of CHO cell expressing human NK receptors.
In DepthDetails US Patent
TargetTachykinin-3(Homo sapiens (Human))
Takeda Pharmaceutical
US Patent
LigandPNGBDBM97475(US8470816, 30)
Affinity DataIC50:  23nMpH: 7.4Assay Description:Radioligan receptor binding inhibitory activity using membrane fraction of CHO cell expressing human NK receptors.
In DepthDetails US Patent
TargetSubstance-K receptor(Homo sapiens (Human))
Takeda Pharmaceutical
US Patent
LigandPNGBDBM97475(US8470816, 30)
Affinity DataIC50:  1.10nMpH: 7.5Assay Description:Radioligan receptor binding inhibitory activity using membrane fraction of CHO cell expressing human NK receptors.
In DepthDetails US Patent