BDBM98093 1-(3-nitrophenyl)-3-[4-(o-tolylsulfonylamino)phenyl]urea::Compound ID 7{2,1}
SMILES Cc1ccccc1S(=O)(=O)Nc1ccc(NC(=O)Nc2cccc(c2)[N+]([O-])=O)cc1
InChI Key InChIKey=MJVSMSUPSNXQDV-UHFFFAOYSA-N
Data  2 IC50
  Tab Delimited (TSV)   2D SDfile   Computed 3D by Vconf -m prep SDfile
Find this compound or compounds like it in BindingDB:
Activity Spreadsheet -- Enzyme Inhibition Constant Data from BindingDB
Found 2 hits for monomerid = 98093
TargetProbable nicotinate-nucleotide adenylyltransferase(Bacillus anthracis)
University of Alabama At Birmingham
LigandPNGBDBM98093(1-(3-nitrophenyl)-3-[4-(o-tolylsulfonylamino)pheny...)
Affinity DataIC50: >1.50E+5nMpH: 7.5 T: 2°C. Assay description: Inhibitory concentration of the compound measured against B. anthracis Nicotinic acid mononucleotide adenylyltransferase (NaMNAT)using HPLC Enzyme As...
In DepthDetails ArticlePubMed
TargetNH(3)-dependent NAD(+) synthetase(Bacillus anthracis)
University of Alabama At Birmingham
LigandPNGBDBM98093(1-(3-nitrophenyl)-3-[4-(o-tolylsulfonylamino)pheny...)
Affinity DataIC50:  5.13E+5nMpH: 8.5 T: 2°C. Assay description: Inhibitory concentration of the compound measured against B. anthracis Nicotinamide adenine dinucleotide synthetase (NADs) using HPLC Enzyme Assay
In DepthDetails ArticlePubMed