BDBM98127 1-(2-nitrophenyl)-3-[4-[[3-(trifluoromethyl)phenyl]sulfonylamino]phenyl]urea::Compound ID 7{3,12}
SMILES [O-][N+](=O)c1ccccc1NC(=O)Nc1ccc(NS(=O)(=O)c2cccc(c2)C(F)(F)F)cc1
InChI Key InChIKey=UIFBRAGMAJYJNS-UHFFFAOYSA-N
Data  2 IC50
  Tab Delimited (TSV)   2D SDfile   Computed 3D by Vconf -m prep SDfile
Find this compound or compounds like it in BindingDB:
Activity Spreadsheet -- Enzyme Inhibition Constant Data from BindingDB
Found 2 hits for monomerid = 98127
TargetProbable nicotinate-nucleotide adenylyltransferase(Bacillus anthracis)
University of Alabama At Birmingham
LigandPNGBDBM98127(1-(2-nitrophenyl)-3-[4-[[3-(trifluoromethyl)phenyl...)
Affinity DataIC50: >1.50E+5nMpH: 7.5 T: 2°C. Assay description: Inhibitory concentration of the compound measured against B. anthracis Nicotinic acid mononucleotide adenylyltransferase (NaMNAT)using HPLC Enzyme As...
In DepthDetails ArticlePubMed
TargetNH(3)-dependent NAD(+) synthetase(Bacillus anthracis)
University of Alabama At Birmingham
LigandPNGBDBM98127(1-(2-nitrophenyl)-3-[4-[[3-(trifluoromethyl)phenyl...)
Affinity DataIC50:  2.98E+5nMpH: 8.5 T: 2°C. Assay description: Inhibitory concentration of the compound measured against B. anthracis Nicotinamide adenine dinucleotide synthetase (NADs) using HPLC Enzyme Assay
In DepthDetails ArticlePubMed