BDBM98137 1-[4-[(3-methoxyphenyl)sulfonylamino]phenyl]-3-(2-nitrophenyl)urea::Compound ID 7{3,16}
SMILES COc1cccc(c1)S(=O)(=O)Nc1ccc(NC(=O)Nc2ccccc2[N+]([O-])=O)cc1
InChI Key InChIKey=AJLABLIEAGZJBY-UHFFFAOYSA-N
Data  2 IC50
  Tab Delimited (TSV)   2D SDfile   Computed 3D by Vconf -m prep SDfile
Find this compound or compounds like it in BindingDB:
Activity Spreadsheet -- Enzyme Inhibition Constant Data from BindingDB
Found 2 hits for monomerid = 98137
TargetProbable nicotinate-nucleotide adenylyltransferase(Bacillus anthracis)
University of Alabama At Birmingham
LigandPNGBDBM98137(1-[4-[(3-methoxyphenyl)sulfonylamino]phenyl]-3-(2-...)
Affinity DataIC50: >1.50E+5nMpH: 7.5 T: 2°C. Assay description: Inhibitory concentration of the compound measured against B. anthracis Nicotinic acid mononucleotide adenylyltransferase (NaMNAT)using HPLC Enzyme As...
In DepthDetails ArticlePubMed
TargetNH(3)-dependent NAD(+) synthetase(Bacillus anthracis)
University of Alabama At Birmingham
LigandPNGBDBM98137(1-[4-[(3-methoxyphenyl)sulfonylamino]phenyl]-3-(2-...)
Affinity DataIC50: >6.00E+5nMpH: 8.5 T: 2°C. Assay description: Inhibitory concentration of the compound measured against B. anthracis Nicotinamide adenine dinucleotide synthetase (NADs) using HPLC Enzyme Assay
In DepthDetails ArticlePubMed