BDBM99205 US8501708, 29
SMILES OC[C@H]1O[C@H]([C@H](O)[C@@H]1O)n1cnc2c(NC3CCC[C@H]3OCc3cccc(F)c3)ncnc12
InChI Key InChIKey=CYHRDMKKFSGMNK-HFALVTKESA-N
Data  3 KI
  Tab Delimited (TSV)   2D SDfile   Computed 3D by Vconf -m prep SDfile
Find this compound or compounds like it in BindingDB:
Activity Spreadsheet -- Enzyme Inhibition Constant Data from BindingDB
Found 3 hits for monomerid = 99205
TargetAdenosine receptor A1(Oryctolagus cuniculus (Rabbit))
Inotek Pharmaceuticals
US Patent
LigandPNGBDBM99205(US8501708, 29)
Affinity DataKi:  2.28nM. Assay description: The compounds were studied in binding assays to determine selectivity and potency to A1, A2a and A3 adenosine receptors.
In DepthDetails US Patent
TargetAdenosine receptor A2(Oryctolagus cuniculus (rabbit))
Inotek Pharmaceuticals
US Patent
LigandPNGBDBM99205(US8501708, 29)
Affinity DataKi:  422nM. Assay description: The compounds were studied in binding assays to determine selectivity and potency to A1, A2a and A3 adenosine receptors.
In DepthDetails US Patent
TargetAdenosine receptor A3(Oryctolagus cuniculus (rabbit))
Inotek Pharmaceuticals
US Patent
LigandPNGBDBM99205(US8501708, 29)
Affinity DataKi:  5.10E+3nM. Assay description: The compounds were studied in binding assays to determine selectivity and potency to A1, A2a and A3 adenosine receptors.
In DepthDetails US Patent