Target
Transient receptor potential cation channel subfamily M member 8
Ligand
BDBM506991
Substrate
IC50
123±n/a nM
Citation
 Aramini, ABianchini, GBrandolini, LBeccari, ALillini, SNano, G 2-aryl-4-hydroxy-1,3-thiazole derivatives useful as TRPM8-inhibitors in treatment of neuralgia, pain, COPD and asthma US Patent  US11046662 Publication Date 6/29/2021 
Target
Name:
Transient receptor potential cation channel subfamily M member 8
Synonyms:
LTRPC6 TRPM8_HUMAN Transient receptor potential M8 protein (TRPM8) Transient receptor potential cation channel subfamily M member 8 (TRPM8)
Type:
Enzyme
Mol. Mass.:
127693.26
Organism:
Homo sapiens (Human)
Description:
Q7Z2W7
Residue:
1104
  
Inhibitor
Name:
BDBM506991
Synonyms:
1-[4-hydroxy-2-(1H-pyrrol-2-yl)-1,3- thiazol-5-yl]propan-1-one | US11046662, Compound 16
Type:
Small organic molecule
Emp. Form.:
C10H10N2O2S
Mol. Mass.:
222.264
SMILES:
CCC(=O)c1sc(nc1O)-c1ccc[nH]1
: