Target
S-adenosylmethionine synthase isoform type-2
Ligand
BDBM507717
Substrate
Meas. Tech.
Malachite Green Assay
IC50
<200±n/a nM
Citation
 Alam, MCleary, LFleury, MPei, ZSteel, RSutton, JKnox, JENewby, ZE 2-oxoquinazoline derivatives as methionine adenosyltransferase 2A inhibitors US Patent  US11046691 Publication Date 6/29/2021 
Target
Name:
S-adenosylmethionine synthase isoform type-2
Synonyms:
AMS2 MAT 2 MAT2A METK2_HUMAN Methionine adenosyltransferase II
Type:
Protein
Mol. Mass.:
43659.65
Organism:
Human
Description:
P31153
Residue:
395
  
Inhibitor
Name:
BDBM507717
Synonyms:
4-(dimethylamino)-7-chloro-1-(4- fluorophenyl)-hydroquinazolin-2-one US11084798, Cpd No 36 | US11130759, Cpd. No. 36
Type:
Small organic molecule
Emp. Form.:
C16H13ClFN3O
Mol. Mass.:
317.745
SMILES:
CN(C)c1nc(=O)n(-c2ccc(F)cc2)c2cc(Cl)ccc12
: