Target
S-adenosylmethionine synthase isoform type-2
Ligand
BDBM507762
Substrate
Meas. Tech.
Biochemical Assay
IC50
<200±n/a nM
Citation
 Alam, MCleary, LFleury, MPei, ZSteel, RSutton, JKnox, JENewby, ZE 2-oxoquinazoline derivatives as methionine adenosyltransferase 2A inhibitors US Patent  US11084798 Publication Date 8/10/2021 
Target
Name:
S-adenosylmethionine synthase isoform type-2
Synonyms:
AMS2 MAT 2 MAT2A METK2_HUMAN Methionine adenosyltransferase II
Type:
Protein
Mol. Mass.:
43659.65
Organism:
Human
Description:
P31153
Residue:
395
  
Inhibitor
Name:
BDBM507762
Synonyms:
7-chloro-4-(dimethylamino)-1-phenyl- quinazolin-2(1H)-one US11084798, Cpd No 24 | US11130759, Cpd. No. 24
Type:
Small organic molecule
Emp. Form.:
C16H14ClN3O
Mol. Mass.:
299.755
SMILES:
CN(C)c1nc(=O)n(-c2ccccc2)c2cc(Cl)ccc12
: