Target
Histone-lysine N-methyltransferase EZH2
Ligand
BDBM172183
Substrate
Meas. Tech.
PRC2 Enzyme Assays on Peptide Substrates
IC50
3.84±n/a nM
Citation
 Kuntz, KWChesworth, RDuncan, KWKeilhack, HWarholic, NKlaus, CKnutson, SKWigle, TJSeki, MShirotori, SKawano, S Aryl-or heteroaryl-substituted benzene compounds US Patent  US11052093 Publication Date 7/6/2021 
Target
Name:
Histone-lysine N-methyltransferase EZH2
Synonyms:
ENX-1 EZH2_HUMAN Histone-lysine N-methyltransferase EZH2 Lysine N-methyltransferase 6
Type:
Protein
Mol. Mass.:
85367.84
Organism:
Homo sapiens (Human)
Description:
Q15910
Residue:
746
  
Inhibitor
Name:
BDBM172183
Synonyms:
US10155002, Compound 191 US9090562, 191
Type:
Small organic molecule
Emp. Form.:
C35H47N5O4
Mol. Mass.:
601.7788
SMILES:
CCCc1cc(C)[nH]c(=O)c1CNC(=O)c1cc(cc(N(CC)C2CCOCC2)c1C)-c1ccc(CN2CCOCC2)nc1
: