Target
S-adenosylmethionine synthase isoform type-2
Ligand
BDBM507721
Substrate
Meas. Tech.
Malachite Green Assay
IC50
<200±n/a nM
Citation
 Alam, MCleary, LFleury, MPei, ZSteel, RSutton, JKnox, JENewby, ZE 2-oxoquinazoline derivatives as methionine adenosyltransferase 2A inhibitors US Patent  US11130759 Publication Date 9/28/2021 
Target
Name:
S-adenosylmethionine synthase isoform type-2
Synonyms:
AMS2 MAT 2 MAT2A METK2_HUMAN Methionine adenosyltransferase II
Type:
Protein
Mol. Mass.:
43659.65
Organism:
Human
Description:
P31153
Residue:
395
  
Inhibitor
Name:
BDBM507721
Synonyms:
7-chloro-6-methoxy-4-(methylamino)- 1-phenylquinazolin-2(1H)-one US11084798, Cpd No 73 | US11130759, Cpd. No. 73
Type:
Small organic molecule
Emp. Form.:
C16H14ClN3O2
Mol. Mass.:
315.754
SMILES:
CNc1nc(=O)n(-c2ccccc2)c2cc(Cl)c(OC)cc12
: