Target
Glycogen synthase kinase-3 beta
Ligand
BDBM8146
Substrate
Biotinylated Peptide Substrate
Meas. Tech.
Kinase Inhibition SPA Assay
Ki
1±n/a nM
IC50
<10±n/a nM
Citation
 Tavares, FXBoucheron, JADickerson, SHGriffin, RJPreugschat, FThomson, SAWang, TYZhou, HQ N-Phenyl-4-pyrazolo[1,5-b]pyridazin-3-ylpyrimidin-2-amines as potent and selective inhibitors of glycogen synthase kinase 3 with good cellular efficacy. J Med Chem 47:4716-30 (2004)  
Target
Name:
Glycogen synthase kinase-3 beta
Synonyms:
GSK-3 beta GSK3B Glycogen synthase kinase 3 beta (GSK3B) Glycogen synthase kinase-3 beta (GSK-3B) Glycogen synthase kinase-3 beta (GSK3B) Glycogen synthase kinase-3beta (GSK3B) | Serine/threonine-protein kinase GSK3B
Type:
Enzyme
Mol. Mass.:
46756.38
Organism:
Homo sapiens (Human)
Description:
P49841
Residue:
420
  
Inhibitor
Name:
BDBM8146
Synonyms:
N-(3,5-dimethylphenyl)-4-{pyrazolo[1,5-a]pyridazin-3-yl}pyrimidin-2-amine | pyrazolo[1,5-b]pyridazine deriv. 37
Type:
Small organic molecule
Emp. Form.:
C18H16N6
Mol. Mass.:
316.3598
SMILES:
Cc1cc(C)cc(Nc2nccc(n2)-c2cnn3ncccc23)c1
:
Substrate
Name:
Biotinylated Peptide Substrate
Synonyms:
Type:
Peptide
Mol. Mass.:
6828.27
Organism:
Description:
Residue:
63