Target
Replicase polyprotein 1ab
Ligand
BDBM525169
Substrate
Meas. Tech.
SARS-CoV-2 3CLPpro inhibition assay
IC50
17±n/a nM
Citation
 Chen, JLiang, CMIAO, KWu, YYun, HZhang, W Aminocarbamoyl compounds for the treatment of viral infections WIPO 0:0 (2022) Target
Name:
Replicase polyprotein 1ab
Synonyms:
ORF1ab polyprotein pp1ab | rep
Type:
Protein
Mol. Mass.:
794070.71
Organism:
2019-nCoV
Description:
P0DTD1
Residue:
7096
  
Inhibitor
Name:
BDBM525169
Synonyms:
Benzyl N-[(1S)-1-[[(2-chloroacetyl)-[(2-oxo-pyrrolidin-3-yl)methyl]amino]carbamoyl]-3-methyl-butyl]carbamate | WO2022043374, Example 18
Type:
Small organic molecule
Emp. Form.:
C21H29ClN4O5
Mol. Mass.:
452.932
SMILES:
CC(C)C[C@H](NC(=O)OCc1ccccc1)C(=O)NN(CC1CCNC1=O)C(=O)CCl
: