Target
P61964[22-334]/Q03164[3745-3969]/Q15291/Q9C005/Q9UBL3[2-534]
Ligand
BDBM50164794
Substrate
Meas. Tech.
MLL1-WRAD2 Enzyme Assay
IC50
9500±n/a nM
Citation
 Al-Awar, RZepeda-Velazquez, CAPoda, GIsaac, MUehling, DWilson, BJoseph, BLiu, YSubramanian, PMamai, A Substituted carboxamides as inhibitors of WDR5 protein-protein binding US Patent  US11174250 Publication Date 11/16/2021 
Target
Name:
P61964[22-334]/Q03164[3745-3969]/Q15291/Q9C005/Q9UBL3[2-534]
Synonyms:
Type:
Protein
Mol. Mass.:
Description:
Combinations of UniProts
Components:
This complex has 5 components.
Component 1
Name:
Protein dpy-30 homolog
Synonyms:
DPY30 Dpy-30-like protein | Dpy-30L
Type:
Protein
Mol. Mass.:
11245.04
Organism:
Human
Description:
Q9C005
Residue:
99
  
Component 2
Name:
Histone-lysine N-methyltransferase 2A [3745-3969]
Synonyms:
ALL1 HRX KMT2A MLL Myeloid/lymphoid or mixed-lineage leukemia (MLL) (aa 3745-3969) | TRX1
Type:
Protein
Mol. Mass.:
26080.01
Organism:
Homo sapiens (Human)
Description:
Q03164[3745-3969]
Residue:
225
  
Component 3
Name:
WD repeat-containing protein 5 [22-334]
Synonyms:
BIG3 WDR5 | WDR5_HUMAN
Type:
Protein
Mol. Mass.:
34356.70
Organism:
Homo sapiens (Human)
Description:
P61964[22-334]
Residue:
313
  
Component 4
Name:
Retinoblastoma-binding protein 5
Synonyms:
RBBP5 RBQ3 | Retinoblastoma-binding protein 5 (RBBP5)
Type:
Protein
Mol. Mass.:
59133.29
Organism:
Homo sapiens (Human)
Description:
Q15291
Residue:
538
  
Component 5
Name:
Set1/Ash2 histone methyltransferase complex subunit ASH2 [2-534]
Synonyms:
ASH2L ASH2L_HUMAN | Ash2-like protein (ASH2L) (aa 2-534)
Type:
Protein
Mol. Mass.:
57897.80
Organism:
Homo sapiens (Human)
Description:
Q9UBL3[2-534]
Residue:
533
  
Inhibitor
Name:
BDBM50164794
Synonyms:
CHEMBL3798846 US11319299, Comp. No. 57
Type:
Small organic molecule
Emp. Form.:
C29H32F3N5O3
Mol. Mass.:
555.5913
SMILES:
CN1CCN(CC1)c1ccc(cc1NC(=O)c1c[nH]c(=O)cc1C(F)(F)F)-c1cccc(CN2CCOCC2)c1
: