Target
Acetyl-CoA carboxylase 2
Ligand
BDBM527006
Substrate
Meas. Tech.
ACC2 Enzyme Activity Assay
IC50
9.64±n/a nM
Citation
 Wang, YZhao, LWang, YQuan, XJiang, CChen, HChen, MLi, CLiao, YLiu, QWang, CWang, HYang, SZheng, G Compound as ACC inhibitor and use thereof US Patent  US11186587 Publication Date 11/30/2021 
Target
Name:
Acetyl-CoA carboxylase 2
Synonyms:
ACACB ACC-beta ACCB Acetyl-CoA carboxylase 2 Acetyl-CoA carboxylase 2 (ACC2)
Type:
Protein
Mol. Mass.:
276535.21
Organism:
Homo sapiens (Human)
Description:
O00763
Residue:
2458
  
Inhibitor
Name:
BDBM527006
Synonyms:
US11186587, Example 6
Type:
Small organic molecule
Emp. Form.:
C27H30N4O6S
Mol. Mass.:
538.615
SMILES:
COc1ccccc1C(Cn1c2sc(c(C)c2c(=O)n(C2CNC2)c1=O)-c1ncco1)OC1CCOCC1
: