Target
Acetyl-CoA carboxylase 1
Ligand
BDBM527544
Substrate
Meas. Tech.
ACC1 Enzyme Activity Assay
IC50
11.8±n/a nM
Citation
 Wang, YZhao, LWang, YQuan, XJiang, CChen, HChen, MLi, CLiao, YLiu, QWang, CWang, HYang, SZheng, G Compound as ACC inhibitor and use thereof US Patent  US11186587 Publication Date 11/30/2021 
Target
Name:
Acetyl-CoA carboxylase 1
Synonyms:
ACAC ACACA_HUMAN ACC1 Acetyl-CoA carboxylase 1 | Acetyl-CoA carboxylase 1 (ACC1)
Type:
Protein
Mol. Mass.:
265543.22
Organism:
Homo sapiens (Human)
Description:
Q13085
Residue:
2346
  
Inhibitor
Name:
BDBM527544
Synonyms:
US11186587, Example 27
Type:
Small organic molecule
Emp. Form.:
C32H31N3O9S
Mol. Mass.:
633.668
SMILES:
COc1ccccc1C(Cn1c2sc(c(C)c2c(=O)n(-c2cc(ccc2OC)C(O)=O)c1=O)-c1ncco1)OC1CCOCC1
: