Target
Phosphatidylinositol 3-kinase catalytic subunit type 3
Ligand
BDBM528011
Substrate
Meas. Tech.
Biochemical Assay
IC50
1.000±n/a nM
Citation
 Martinsson, JAndersson, MLindström, JForsblom, RRahm, FGinman, TViklund, J 6-heterocyclyl-4-morpholin-4-ylpyridine-2-one compounds useful for the treatment of cancer and diabetes US Patent  US11179399 Publication Date 11/23/2021 
Target
Name:
Phosphatidylinositol 3-kinase catalytic subunit type 3
Synonyms:
BC033004 PIK3C3 Phosphatidylinositol 3-kinase catalytic subunit type 3 (PIK3C3) Phosphoinositide 3-Kinase (PI3K), Vps34 PtdIns-3-kinase type 3 hVPS34
Type:
Enzyme
Mol. Mass.:
101551.30
Organism:
Homo sapiens (Human)
Description:
Recombinant human Vps34 protein was expressed as monomeric GST-fusion and purified.
Residue:
887
  
Inhibitor
Name:
BDBM528011
Synonyms:
US11179399, Example 44_1
Type:
Small organic molecule
Emp. Form.:
C22H29N3O3
Mol. Mass.:
383.484
SMILES:
COc1cccc(c1)[C@@H]1CCCCN1c1cc(cc(=O)[nH]1)N1CCOC[C@H]1C
: