Target
Phosphatidylinositol 3-kinase catalytic subunit type 3
Ligand
BDBM532272
Substrate
Meas. Tech.
Vps34 Biochemical Assay
IC50
<5.00±n/a nM
Citation
 Lindström, JForsblom, RGinman, TRahm, FViklund, J Pyridinamine-pyridone and pyrimidinamine- pyridone compounds US Patent  US11208423 Publication Date 12/28/2021 
Target
Name:
Phosphatidylinositol 3-kinase catalytic subunit type 3
Synonyms:
BC033004 PIK3C3 Phosphatidylinositol 3-kinase catalytic subunit type 3 (PIK3C3) Phosphoinositide 3-Kinase (PI3K), Vps34 PtdIns-3-kinase type 3 hVPS34
Type:
Enzyme
Mol. Mass.:
101551.30
Organism:
Homo sapiens (Human)
Description:
Recombinant human Vps34 protein was expressed as monomeric GST-fusion and purified.
Residue:
887
  
Inhibitor
Name:
BDBM532272
Synonyms:
4-[2-(Oxazol-2-ylamino)-4-pyridyl]-6-[3-(trifluoromethyl)morpholin-4-yl]-1H-pyridin-2-one US11780858, Example 40
Type:
Small organic molecule
Emp. Form.:
C18H16F3N5O3
Mol. Mass.:
407.3465
SMILES:
FC(F)(F)C1COCCN1c1cc(cc(=O)[nH]1)-c1ccnc(Nc2ncco2)c1
: