Target
Phosphatidylinositol 3-kinase catalytic subunit type 3
Ligand
BDBM532274
Substrate
Meas. Tech.
Vps34 Biochemical Assay
IC50
<5.00±n/a nM
Citation
 Lindström, JForsblom, RGinman, TRahm, FViklund, J Pyridinamine-pyridone and pyrimidinamine- pyridone compounds US Patent  US11208423 Publication Date 12/28/2021 
Target
Name:
Phosphatidylinositol 3-kinase catalytic subunit type 3
Synonyms:
BC033004 PIK3C3 Phosphatidylinositol 3-kinase catalytic subunit type 3 (PIK3C3) Phosphoinositide 3-Kinase (PI3K), Vps34 PtdIns-3-kinase type 3 hVPS34
Type:
Enzyme
Mol. Mass.:
101551.30
Organism:
Homo sapiens (Human)
Description:
Recombinant human Vps34 protein was expressed as monomeric GST-fusion and purified.
Residue:
887
  
Inhibitor
Name:
BDBM532274
Synonyms:
4-[2-[(2-Methylpyrimidin-4-yl)amino]-4-pyridyl]-6-[2-(trifluoromethyl)phenyl]-1H-pyridin-2-one US11780858, Example 47
Type:
Small organic molecule
Emp. Form.:
C22H16F3N5O
Mol. Mass.:
423.3905
SMILES:
Cc1nccc(Nc2cc(ccn2)-c2cc([nH]c(=O)c2)-c2ccccc2C(F)(F)F)n1
: