Target
Lysine-specific demethylase 5B
Ligand
BDBM314099
Substrate
Meas. Tech.
Time Resolved-Fluorescence Resonance Energy Transfer (TR-FRET)
IC50
<100±n/a nM
Citation
 Chen, YKKanouni, TNie, ZStafford, JAVeal, JMWallace, MB Histone demethylase inhibitors US Patent  US11214542 Publication Date 1/4/2022 
Target
Name:
Lysine-specific demethylase 5B
Synonyms:
CT31 Histone demethylase JARID1B Jumonji/ARID domain-containing protein 1B KDM5B_HUMAN Lysine-specific demethylase 5B (KDM5Flag-5B-FL) PLU1 RBP2-H1 | Retinoblastoma-binding protein 2 homolog 1
Type:
Protein
Mol. Mass.:
175659.67
Organism:
Homo sapiens (Human)
Description:
Q9UGL1
Residue:
1544
  
Inhibitor
Name:
BDBM314099
Synonyms:
3-[(3-fluorobenzyl)amino]pyridine-4-carboxylic acid US10807956, Example 3 US11639333, Example 3 US9725441, Example 3 | US9828343, Example 3
Type:
Small organic molecule
Emp. Form.:
C13H11FN2O2
Mol. Mass.:
246.237
SMILES:
OC(=O)c1ccncc1NCc1cccc(F)c1
: