Target
Lysine-specific demethylase 4C
Ligand
BDBM314111
Substrate
Meas. Tech.
Time Resolved-Fluorescence Resonance Energy Transfer (TR-FRET)
IC50
<100±n/a nM
Citation
 Chen, YKKanouni, TNie, ZStafford, JAVeal, JMWallace, MB Histone demethylase inhibitors US Patent  US11214542 Publication Date 1/4/2022 
Target
Name:
Lysine-specific demethylase 4C
Synonyms:
GASC-1 protein Gene amplified in squamous cell carcinoma 1 protein JMJD2C Jumonji domain-containing protein 2C KDM4C_HUMAN | KIAA0780
Type:
Protein
Mol. Mass.:
119979.01
Organism:
Homo sapiens (Human)
Description:
Q9H3R0
Residue:
1056
  
Inhibitor
Name:
BDBM314111
Synonyms:
3-[(4-chloro-2-methylbenzyl)amino]pyridine-4-carboxylic acid US10807956, Example 15 US11639333, Example 15 US9725441, Example 15 | US9828343, Example 15
Type:
Small organic molecule
Emp. Form.:
C14H13ClN2O2
Mol. Mass.:
276.718
SMILES:
Cc1cc(Cl)ccc1CNc1cnccc1C(O)=O
: