Target
Lysine-specific demethylase 5A
Ligand
BDBM314115
Substrate
Meas. Tech.
Time Resolved-Fluorescence Resonance Energy Transfer (TR-FRET)
IC50
<100±n/a nM
Citation
 Chen, YKKanouni, TNie, ZStafford, JAVeal, JMWallace, MB Histone demethylase inhibitors US Patent  US11214542 Publication Date 1/4/2022 
Target
Name:
Lysine-specific demethylase 5A
Synonyms:
Histone demethylase JARID1A Jumonji/ARID domain-containing protein 1A KDM5A_HUMAN RBBP-2 RBP2 | Retinoblastoma-binding protein 2
Type:
Protein
Mol. Mass.:
192091.79
Organism:
Homo sapiens (Human)
Description:
P29375
Residue:
1690
  
Inhibitor
Name:
BDBM314115
Synonyms:
3-[(2-cyclopropylbenzyl)amino]pyridine-4-carboxylic acid US10807956, Example 19 US11639333, Example 19 US9725441, Example 19 | US9828343, Example 19
Type:
Small organic molecule
Emp. Form.:
C16H16N2O2
Mol. Mass.:
268.3104
SMILES:
OC(=O)c1ccncc1NCc1ccccc1C1CC1
: