Target
Phosphatidylinositol 3-kinase catalytic subunit type 3
Ligand
BDBM532963
Substrate
Meas. Tech.
Biochemical Assay
IC50
5.00±n/a nM
Citation
 Lindström, JForsblom, RGinman, TRahm, FViklund, J Pyridylpyridone compounds US Patent  US11219618 Publication Date 1/11/2022 
Target
Name:
Phosphatidylinositol 3-kinase catalytic subunit type 3
Synonyms:
BC033004 PIK3C3 Phosphatidylinositol 3-kinase catalytic subunit type 3 (PIK3C3) Phosphoinositide 3-Kinase (PI3K), Vps34 PtdIns-3-kinase type 3 hVPS34
Type:
Enzyme
Mol. Mass.:
101551.30
Organism:
Homo sapiens (Human)
Description:
Recombinant human Vps34 protein was expressed as monomeric GST-fusion and purified.
Residue:
887
  
Inhibitor
Name:
BDBM532963
Synonyms:
N-[4-[2-(3-cyclopropylmorpholin-4-yl)-6-oxo-1H-pyridin-4-yl]-2-pyridyl]acetamide | US11219618, Example 32
Type:
Small organic molecule
Emp. Form.:
C19H22N4O3
Mol. Mass.:
354.403
SMILES:
CC(=O)Nc1cc(ccn1)-c1cc([nH]c(=O)c1)N1CCOCC1C1CC1
: