Target
Cyclin-A2/Cyclin-dependent kinase 2
Ligand
BDBM8337
Substrate
Histone H1
Meas. Tech.
Kinase Inhibition Assay
pH
7.5±n/a
Temperature
294.15±n/a K
Ki
5±n/a nM
Comments
99% inhibition @ 10 uM
Citation
 Witherington, JBordas, VHaigh, DHickey, DMIfe, RJRawlings, ADSlingsby, BPSmith, DGWard, RW 5-aryl-pyrazolo[3,4-b]pyridazines: potent inhibitors of glycogen synthase kinase-3 (GSK-3). Bioorg Med Chem Lett 13:1581-4 (2003)  
Target
Name:
Cyclin-A2/Cyclin-dependent kinase 2
Synonyms:
CDK2-CyclinA CDK2/Cyclin A Cyclin A2/dependent kinase 2 Cyclin-Dependent Kinase 2 (CDK2A)
Type:
Protein Complex
Mol. Mass.:
Description:
Cdk2/Cyclin A kinase was purified from insect cells coinfected with Cyclin A/Cdk2 baculovirus.
Components:
This complex has 2 components.
Component 1
Name:
Cyclin-dependent kinase 2
Synonyms:
CDK2 CDK2_HUMAN Cell division protein kinase 2 Protein cereblon/Cyclin-dependent kinase 2 | p33 protein kinase
Type:
Enzyme Subunit
Mol. Mass.:
33938.17
Organism:
Homo sapiens (Human)
Description:
P24941
Residue:
298
  
Component 2
Name:
Cyclin-A2
Synonyms:
CCN1 CCNA1 CCNA2_HUMAN Cyclin-A
Type:
Enzyme Subunit
Mol. Mass.:
48550.19
Organism:
Homo sapiens (Human)
Description:
P20248
Residue:
432
  
Inhibitor
Name:
BDBM8337
Synonyms:
N-[5-(2,3-difluorophenyl)-1H-pyrazolo[3,4-c]pyridazin-3-yl]cyclopentanecarboxamide | pyrazolopyridazine deriv. 17
Type:
Small organic molecule
Emp. Form.:
C17H15F2N5O
Mol. Mass.:
343.3307
SMILES:
Fc1cccc(c1F)-c1cc2c(NC(=O)C3CCCC3)n[nH]c2nn1
:
Substrate
Name:
Histone H1
Synonyms:
Type:
Other Protein Type
Mol. Mass.:
358.43
Organism:
Bos taurus (bovine)
Description:
Residue:
3
NA