Target
Proto-oncogene tyrosine-protein kinase receptor Ret
Ligand
BDBM305368
Substrate
Meas. Tech.
RET Enzyme Assay
IC50
5.80±n/a nM
Citation
 Andrews, SWAronow, SBlake, JFBrandhuber, BJCollier, JCook, AHaas, JJiang, YKolakowski, GRMcFaddin, EAMcKenney, MLMcNulty, OTMetcalf, ATMoreno, DARamann, GATang, TPRen, LWalls, SM Substituted pyrazolo[1,5-A]pyridine compounds as RET kinase inhibitors US Patent  US10144734 Publication Date 12/4/2018 
Target
Name:
Proto-oncogene tyrosine-protein kinase receptor Ret
Synonyms:
CDHF12 Cadherin family member 12 Proto-oncogene c-Ret RET51 Tyrosine-protein kinase Ret (RET)
Type:
Protein
Mol. Mass.:
124318.29
Organism:
Homo sapiens (Human)
Description:
P07949
Residue:
1114
  
Inhibitor
Name:
BDBM305368
Synonyms:
US10144734, Example 385 US10441581, Example 385 US11648243, Example 385
Type:
Small organic molecule
Emp. Form.:
C28H37N7O2
Mol. Mass.:
503.6391
SMILES:
CCOc1cc(-c2ccc(nc2)N2CCC(CN(C)C)(CC2)NC(=O)CC(C)C)c2c(cnn2c1)C#N
: