Target
Proto-oncogene tyrosine-protein kinase receptor Ret
Ligand
BDBM305374
Substrate
Meas. Tech.
RET Enzyme Assay
IC50
6.70±n/a nM
Citation
 Andrews, SWAronow, SBlake, JFBrandhuber, BJCollier, JCook, AHaas, JJiang, YKolakowski, GRMcFaddin, EAMcKenney, MLMcNulty, OTMetcalf, ATMoreno, DARamann, GATang, TPRen, LWalls, SM Substituted pyrazolo[1,5-A]pyridine compounds as RET kinase inhibitors US Patent  US10144734 Publication Date 12/4/2018 
Target
Name:
Proto-oncogene tyrosine-protein kinase receptor Ret
Synonyms:
CDHF12 Cadherin family member 12 Proto-oncogene c-Ret RET51 Tyrosine-protein kinase Ret (RET)
Type:
Protein
Mol. Mass.:
124318.29
Organism:
Homo sapiens (Human)
Description:
P07949
Residue:
1114
  
Inhibitor
Name:
BDBM305374
Synonyms:
US10144734, Example 391 US10441581, Example 391 US11648243, Example 391
Type:
Small organic molecule
Emp. Form.:
C34H38F2N8O2
Mol. Mass.:
628.7147
SMILES:
CCOc1cc(-c2ccc(nc2)N2CCC(CN3CCN(CC)CC3)(CC2)NC(=O)c2cc(F)ccc2F)c2c(cnn2c1)C#N
: