Target
Proto-oncogene tyrosine-protein kinase receptor Ret
Ligand
BDBM305687
Substrate
Meas. Tech.
RET Enzyme Assay
IC50
4.60±n/a nM
Citation
 Andrews, SWAronow, SBlake, JFBrandhuber, BJCollier, JCook, AHaas, JJiang, YKolakowski, GRMcFaddin, EAMcKenney, MLMcNulty, OTMetcalf, ATMoreno, DARamann, GATang, TPRen, LWalls, SM Substituted pyrazolo[1,5-A]pyridine compounds as RET kinase inhibitors US Patent  US10144734 Publication Date 12/4/2018 
Target
Name:
Proto-oncogene tyrosine-protein kinase receptor Ret
Synonyms:
CDHF12 Cadherin family member 12 Proto-oncogene c-Ret RET51 Tyrosine-protein kinase Ret (RET)
Type:
Protein
Mol. Mass.:
124318.29
Organism:
Homo sapiens (Human)
Description:
P07949
Residue:
1114
  
Inhibitor
Name:
BDBM305687
Synonyms:
US10144734, Example 705 US10441581, Example 705 US11648243, Example 705
Type:
Small organic molecule
Emp. Form.:
C31H32ClFN8O2
Mol. Mass.:
603.09
SMILES:
Cc1cccc(Cl)c1C(=O)NC1(C)CCN(CC1)c1cnc(cn1)-c1cc(OCC2(F)CCNC2)cn2ncc(C#N)c12
: