Target
Proto-oncogene tyrosine-protein kinase receptor Ret
Ligand
BDBM305693
Substrate
Meas. Tech.
RET Enzyme Assay
IC50
6.00±n/a nM
Citation
 Andrews, SWAronow, SBlake, JFBrandhuber, BJCollier, JCook, AHaas, JJiang, YKolakowski, GRMcFaddin, EAMcKenney, MLMcNulty, OTMetcalf, ATMoreno, DARamann, GATang, TPRen, LWalls, SM Substituted pyrazolo[1,5-A]pyridine compounds as RET kinase inhibitors US Patent  US10144734 Publication Date 12/4/2018 
Target
Name:
Proto-oncogene tyrosine-protein kinase receptor Ret
Synonyms:
CDHF12 Cadherin family member 12 Proto-oncogene c-Ret RET51 Tyrosine-protein kinase Ret (RET)
Type:
Protein
Mol. Mass.:
124318.29
Organism:
Homo sapiens (Human)
Description:
P07949
Residue:
1114
  
Inhibitor
Name:
BDBM305693
Synonyms:
2-chloro-N-((3S,4S)-1-(5- (3-cyano-6- ethoxypyrazolo[1,5- a]pyridin-4-yl)pyrazin-2- yl)-3-hydroxypiperidin-4- yl)-6-fluorobenzamide US10172845, Example 711 US10881652, Example 711 | US11648243, Example 711
Type:
Small organic molecule
Emp. Form.:
C26H23ClFN7O3
Mol. Mass.:
535.957
SMILES:
CCOc1cc(-c2cnc(cn2)N2CC[C@H](NC(=O)c3c(F)cccc3Cl)[C@@H](O)C2)c2c(cnn2c1)C#N
: