Target
Proto-oncogene tyrosine-protein kinase receptor Ret
Ligand
BDBM305713
Substrate
Meas. Tech.
RET Enzyme Assay
IC50
5.00±n/a nM
Citation
 Andrews, SWAronow, SBlake, JFBrandhuber, BJCollier, JCook, AHaas, JJiang, YKolakowski, GRMcFaddin, EAMcKenney, MLMcNulty, OTMetcalf, ATMoreno, DARamann, GATang, TPRen, LWalls, SM Substituted pyrazolo[1,5-A]pyridine compounds as RET kinase inhibitors US Patent  US10144734 Publication Date 12/4/2018 
Target
Name:
Proto-oncogene tyrosine-protein kinase receptor Ret
Synonyms:
CDHF12 Cadherin family member 12 Proto-oncogene c-Ret RET51 Tyrosine-protein kinase Ret (RET)
Type:
Protein
Mol. Mass.:
124318.29
Organism:
Homo sapiens (Human)
Description:
P07949
Residue:
1114
  
Inhibitor
Name:
BDBM305713
Synonyms:
N-((3S,4S)-3-amino-1-(5- (3-cyano-6- ethoxypyrazolo[1,5- a]pyridin-4-yl)pyridin-2- yl)piperidin-4-yl)-5- fluoro-2-methylbenzamide US10172845, Example 731 US10881652, Example 731 | US11648243, Example 731
Type:
Small organic molecule
Emp. Form.:
C28H28FN7O2
Mol. Mass.:
513.566
SMILES:
CCOc1cc(-c2ccc(nc2)N2CC[C@H](NC(=O)c3cc(F)ccc3C)[C@@H](N)C2)c2c(cnn2c1)C#N
: