Target
Proto-oncogene tyrosine-protein kinase receptor Ret
Ligand
BDBM305724
Substrate
Meas. Tech.
RET Enzyme Assay
IC50
4.00±n/a nM
Citation
 Andrews, SWAronow, SBlake, JFBrandhuber, BJCollier, JCook, AHaas, JJiang, YKolakowski, GRMcFaddin, EAMcKenney, MLMcNulty, OTMetcalf, ATMoreno, DARamann, GATang, TPRen, LWalls, SM Substituted pyrazolo[1,5-A]pyridine compounds as RET kinase inhibitors US Patent  US10144734 Publication Date 12/4/2018 
Target
Name:
Proto-oncogene tyrosine-protein kinase receptor Ret
Synonyms:
CDHF12 Cadherin family member 12 Proto-oncogene c-Ret RET51 Tyrosine-protein kinase Ret (RET)
Type:
Protein
Mol. Mass.:
124318.29
Organism:
Homo sapiens (Human)
Description:
P07949
Residue:
1114
  
Inhibitor
Name:
BDBM305724
Synonyms:
4-(6-(4-(3-fluorobenzyl)- 4-hydroxypiperidin-1- yl)pyridin-3-yl)-6-(2- hydroxy-2- methylpropoxy) pyrazolo[1,5-a] pyridine-3-carbonitrile US10172845, Example 742 US10881652, Example 742 | US11648243, Example 742
Type:
Small organic molecule
Emp. Form.:
C29H30FN5O3
Mol. Mass.:
515.5786
SMILES:
CC(C)(O)COc1cc(-c2ccc(nc2)N2CCC(O)(Cc3cccc(F)c3)CC2)c2c(cnn2c1)C#N
: