Target
Proto-oncogene tyrosine-protein kinase receptor Ret
Ligand
BDBM305759
Substrate
Meas. Tech.
RET Enzyme Assay
IC50
3.00±n/a nM
Citation
 Andrews, SWAronow, SBlake, JFBrandhuber, BJCollier, JCook, AHaas, JJiang, YKolakowski, GRMcFaddin, EAMcKenney, MLMcNulty, OTMetcalf, ATMoreno, DARamann, GATang, TPRen, LWalls, SM Substituted pyrazolo[1,5-A]pyridine compounds as RET kinase inhibitors US Patent  US10144734 Publication Date 12/4/2018 
Target
Name:
Proto-oncogene tyrosine-protein kinase receptor Ret
Synonyms:
CDHF12 Cadherin family member 12 Proto-oncogene c-Ret RET51 Tyrosine-protein kinase Ret (RET)
Type:
Protein
Mol. Mass.:
124318.29
Organism:
Homo sapiens (Human)
Description:
P07949
Residue:
1114
  
Inhibitor
Name:
BDBM305759
Synonyms:
3-chloro-N-(1-(5-(3- cyano-6- ethoxypyrazolo[1,5- a]pyridin-4-yl)pyrazin-2- yl)-4-methylpiperidin-4- yl)-6-methylpicolinamide US10172845, Example 777 US10881652, Example 777 | US11648243, Example 777
Type:
Small organic molecule
Emp. Form.:
C27H27ClN8O2
Mol. Mass.:
531.009
SMILES:
CCOc1cc(-c2cnc(cn2)N2CCC(C)(CC2)NC(=O)c2nc(C)ccc2Cl)c2c(cnn2c1)C#N
: