Target
Proto-oncogene tyrosine-protein kinase receptor Ret
Ligand
BDBM305765
Substrate
Meas. Tech.
RET Enzyme Assay
IC50
3.00±n/a nM
Citation
 Andrews, SWAronow, SBlake, JFBrandhuber, BJCollier, JCook, AHaas, JJiang, YKolakowski, GRMcFaddin, EAMcKenney, MLMcNulty, OTMetcalf, ATMoreno, DARamann, GATang, TPRen, LWalls, SM Substituted pyrazolo[1,5-A]pyridine compounds as RET kinase inhibitors US Patent  US10144734 Publication Date 12/4/2018 
Target
Name:
Proto-oncogene tyrosine-protein kinase receptor Ret
Synonyms:
CDHF12 Cadherin family member 12 Proto-oncogene c-Ret RET51 Tyrosine-protein kinase Ret (RET)
Type:
Protein
Mol. Mass.:
124318.29
Organism:
Homo sapiens (Human)
Description:
P07949
Residue:
1114
  
Inhibitor
Name:
BDBM305765
Synonyms:
2-chloro-N-(1-(5-(3- cyano-6- hydroxypyrazolo [1,5-a]pyridin- 4-yl)pyrazin-2-yl)-4- methylpiperidin-4- yl)-6- methylbenzamide US10172845, Example 783 US10881652, Example 783 | US11648243, Example 783
Type:
Small organic molecule
Emp. Form.:
C26H24ClN7O2
Mol. Mass.:
501.967
SMILES:
Cc1cccc(Cl)c1C(=O)NC1(C)CCN(CC1)c1cnc(cn1)-c1cc(O)cn2ncc(C#N)c12
: