Target
Proto-oncogene tyrosine-protein kinase receptor Ret
Ligand
BDBM305795
Substrate
Meas. Tech.
RET Enzyme Assay
IC50
6.00±n/a nM
Citation
 Andrews, SWAronow, SBlake, JFBrandhuber, BJCollier, JCook, AHaas, JJiang, YKolakowski, GRMcFaddin, EAMcKenney, MLMcNulty, OTMetcalf, ATMoreno, DARamann, GATang, TPRen, LWalls, SM Substituted pyrazolo[1,5-A]pyridine compounds as RET kinase inhibitors US Patent  US10144734 Publication Date 12/4/2018 
Target
Name:
Proto-oncogene tyrosine-protein kinase receptor Ret
Synonyms:
CDHF12 Cadherin family member 12 Proto-oncogene c-Ret RET51 Tyrosine-protein kinase Ret (RET)
Type:
Protein
Mol. Mass.:
124318.29
Organism:
Homo sapiens (Human)
Description:
P07949
Residue:
1114
  
Inhibitor
Name:
BDBM305795
Synonyms:
(R)-N-(4-benzyl-1-(5-(3- cyano-6- ethoxypyrazolo[1,5- a]pyridin-4-yl)pyridin-2- yl)piperidin-4-yl)-2,3- dihydroxypropanamide US10172845, Example 813 US10881652, Example 813 | US11648243, Example 813
Type:
Small organic molecule
Emp. Form.:
C30H32N6O4
Mol. Mass.:
540.6129
SMILES:
CCOc1cc(-c2ccc(nc2)N2CCC(Cc3ccccc3)(CC2)NC(=O)[C@H](O)CO)c2c(cnn2c1)C#N
: