Target
Eukaryotic translation initiation factor 4E-binding protein 1
Ligand
BDBM545132
Substrate
Meas. Tech.
Fluorescence Polarization Assay
IC50
2.98±n/a nM
Citation
 Sperry, SXiang, AXErnst, JTReich, SHSprengeler, PAShaghafi, MMichels, TNilewski, CTran, CVPackard, GKGrubbs, AUrkalan, KMukaiyama, T EIF4E-inhibiting compounds and methods US Patent  US11286268 Publication Date 3/29/2022 
Target
Name:
Eukaryotic translation initiation factor 4E-binding protein 1
Synonyms:
4EBP1_HUMAN GFP-4EBP Green fluorescent protein-Eukaryotic initiation factor 4E (eIF4E) binding protein
Type:
Fusion protein
Mol. Mass.:
12578.35
Organism:
Homo sapiens (Human)
Description:
Residue:
118
  
Inhibitor
Name:
BDBM545132
Synonyms:
US11286268, Compound 618
Type:
Small organic molecule
Emp. Form.:
C34H32ClF2N5O5S
Mol. Mass.:
696.163
SMILES:
CN(Cc1cc2nc(C)n(CCOc3ccc(Cl)cc3-c3cc(C)nc4c(csc34)C(O)=O)c(=O)c2c(C#N)c1OC(F)F)C(C)(C)C
: