Target
WD repeat-containing protein 5
Ligand
BDBM50164794
Substrate
Meas. Tech.
Surface Plasmon Resonance (SPR) Assay
Kd
36.0±n/a nM
Citation
 Al-Awar, RZepeda-Velazquez, CAPoda, GIsaac, MUehling, DWilson, BJoseph, BLiu, YSubramanian, PMamai, APrakesch, MStille, JK Substituted carboxamides as inhibitors of WDR5 protein-protein binding US Patent  US11319299 Publication Date 5/3/2022 
Target
Name:
WD repeat-containing protein 5
Synonyms:
BIG3 WD repeat-containing protein 5 (WDR5) WDR5 | WDR5_HUMAN
Type:
Protein
Mol. Mass.:
36597.13
Organism:
Homo sapiens (Human)
Description:
P61964
Residue:
334
  
Inhibitor
Name:
BDBM50164794
Synonyms:
CHEMBL3798846 US11319299, Comp. No. 57
Type:
Small organic molecule
Emp. Form.:
C29H32F3N5O3
Mol. Mass.:
555.5913
SMILES:
CN1CCN(CC1)c1ccc(cc1NC(=O)c1c[nH]c(=O)cc1C(F)(F)F)-c1cccc(CN2CCOCC2)c1
: