Target
Non-receptor tyrosine-protein kinase TYK2
Ligand
BDBM463591
Substrate
Meas. Tech.
Tyk2 & JAK2 Radioactive Kinase Assay
Ki
5±n/a nM
Citation
 Masse, CEGreenwood, JRRomero, DLHarriman, GCWester, RTShelley, MKennedy-Smith, JJDahlgren, MMondal, SRobinson, S TYK2 inhibitors and uses thereof US Patent  US11434240 Publication Date 9/6/2022 
Target
Name:
Non-receptor tyrosine-protein kinase TYK2
Synonyms:
Non-receptor tyrosine-protein kinase TYK2 (TYK2) TYK2_HUMAN | Tyrosine-protein kinase TYK2
Type:
Protein
Mol. Mass.:
133666.03
Organism:
Homo sapiens (Human)
Description:
P29597
Residue:
1187
  
Inhibitor
Name:
BDBM463591
Synonyms:
US10781204, Compound I-111 US10781204, Compound I-71 | US11434240, Compound I-111
Type:
Small organic molecule
Emp. Form.:
C23H21FN6O2
Mol. Mass.:
432.4502
SMILES:
C[C@@]1(O)CCCN(C1)c1ccn(n1)-c1cc(nc2CNC(=O)c12)-c1c(F)cccc1C#N
: