Target
Transmembrane anterior posterior transformation protein 1 homolog
Ligand
BDBM575085
Substrate
Meas. Tech.
Assessing Antiviral Activity Against Human Cytomegalovirus (HCMV)
IC50
803±n/a nM
Citation
 Remiszewski, SChiang, LWMurphy, EASun, QKayser, FFink, SJ Broad spectrum antiviral compositions and methods US Patent  US11459321 Publication Date 10/4/2022 
Target
Name:
Transmembrane anterior posterior transformation protein 1 homolog
Synonyms:
CMVFR TAPT1 | TAPT1_HUMAN
Type:
Protein
Mol. Mass.:
64270.48
Organism:
Human
Description:
Q6NXT6
Residue:
567
  
Inhibitor
Name:
BDBM575085
Synonyms:
US11459321, Example 31
Type:
Small organic molecule
Emp. Form.:
C26H28N4O3S
Mol. Mass.:
476.591
SMILES:
O=C1OCCN1c1ccc2CCN(Cc2c1)c1ncc(Cc2ccc(cc2)N2CCOCC2)s1
: