Target
Diacylglycerol O-acyltransferase 2
Ligand
BDBM504504
Substrate
Meas. Tech.
In Vitro DGAT2 Assay and Determination of IC50 Values for DGAT2 Inhibitors
IC50
230±n/a nM
Citation
 Edmonds, DJFilipski, KJFutatsugi, KGarnsey, MRLee, JCSmaltz, DJ Diacylglycerol acyl transferase 2 inhibitor US Patent  US11471458 Publication Date 10/18/2022 
Target
Name:
Diacylglycerol O-acyltransferase 2
Synonyms:
ARAT DGAT2 Diacylglycerol O-acyltransferase 2 (DGAT2) Retinol O-fatty-acyltransferase
Type:
Multi-pass membrane protein
Mol. Mass.:
43848.90
Organism:
Homo sapiens (Human)
Description:
Q96PD7
Residue:
388
  
Inhibitor
Name:
BDBM504504
Synonyms:
N-(5,5-difluoropiperidin-3-yl)-2-{5-[(3- ethoxypyridin-2-yl)oxy]pyridin-3- yl}pyrimidine-5-carboxamide US11471458, Example 17 | US20230405002, Example 17
Type:
Small organic molecule
Emp. Form.:
C22H22F2N6O3
Mol. Mass.:
456.4453
SMILES:
CCOc1cccnc1Oc1cncc(c1)-c1ncc(cn1)C(=O)NC1CNCC(F)(F)C1
: