Target
Replicase polyprotein 1ab
Ligand
BDBM509871
Substrate
Meas. Tech.
Evaluation of Antiviral Activity of Compounds Against Human Coronavirus (HCov) 229E
IC50
<2000±n/a nM
Citation
 Arnold, LDJennings, AKeung, W Inhibitors of cysteine proteases and methods of use thereof US Patent  US11472793 Publication Date 10/18/2022 
Target
Name:
Replicase polyprotein 1ab
Synonyms:
ORF1ab polyprotein pp1ab | rep
Type:
Protein
Mol. Mass.:
754187.17
Organism:
HCoV-229E
Description:
P0C6X1
Residue:
6758
  
Inhibitor
Name:
BDBM509871
Synonyms:
US11124497, Compound 405 US11351149, Example 50 US11524940, Compound 405
Type:
Small organic molecule
Emp. Form.:
C24H31N5O4
Mol. Mass.:
453.534
SMILES:
COc1cccc2[nH]c(cc12)C(=O)N[C@@H](CC(C)(C)C)C(=O)N[C@@H](C[C@@H]1CCNC1=O)C#N
: