Target
Tyrosine-protein kinase JAK1
Ligand
BDBM584521
Substrate
Meas. Tech.
ADP-Glo Kinase Assay
IC50
<20±n/a nM
Citation
 Lee, HWJi, MKKim, SCYu, HNJung, SYPark, JLee, YLee, HKi, SYKim, DKim, M Heterocyclic compound as a protein kinase inhibitor US Patent  US11524968 Publication Date 12/13/2022 
Target
Name:
Tyrosine-protein kinase JAK1
Synonyms:
JAK-1 JAK1A JAK1_HUMAN Janus kinase 1 (JAK1) | Janus kinase 1 JAK1
Type:
Protein
Mol. Mass.:
133293.73
Organism:
Homo sapiens (Human)
Description:
P23458
Residue:
1154
  
Inhibitor
Name:
BDBM584521
Synonyms:
US11524968, Example 269
Type:
Small organic molecule
Emp. Form.:
C20H21N5O2
Mol. Mass.:
363.413
SMILES:
CC(C#N)C(=O)N1CCC(=CC1)c1cc(NC(=O)C2CC2)nc2[nH]ccc12
: