Target
Tyrosine-protein kinase JAK1
Ligand
BDBM584544
Substrate
Meas. Tech.
ADP-Glo Kinase Assay
IC50
<20±n/a nM
Citation
 Lee, HWJi, MKKim, SCYu, HNJung, SYPark, JLee, YLee, HKi, SYKim, DKim, M Heterocyclic compound as a protein kinase inhibitor US Patent  US11524968 Publication Date 12/13/2022 
Target
Name:
Tyrosine-protein kinase JAK1
Synonyms:
JAK-1 JAK1A JAK1_HUMAN Janus kinase 1 (JAK1) | Janus kinase 1 JAK1
Type:
Protein
Mol. Mass.:
133293.73
Organism:
Homo sapiens (Human)
Description:
P23458
Residue:
1154
  
Inhibitor
Name:
BDBM584544
Synonyms:
US11524968, Example 292
Type:
Small organic molecule
Emp. Form.:
C20H19N5O2S
Mol. Mass.:
393.462
SMILES:
O=C(Nc1cc(C2=CCN(CC2)C(=O)c2cnsc2)c2cc[nH]c2n1)C1CC1
: