Target
Mitogen-activated protein kinase kinase kinase kinase 1
Ligand
BDBM500610
Substrate
Meas. Tech.
HPK1 Biochemical Enzyme Assay
IC50
<100±n/a nM
Citation
 Kaila, NLinney, IWard, SWishart, GWhittaker, BCote, AGreenwood, JRLeffler, AAlbanese, SKSeverance, DL HPK1 antagonists and uses thereof US Patent  US11548890 Publication Date 1/10/2023 
Target
Name:
Mitogen-activated protein kinase kinase kinase kinase 1
Synonyms:
HPK1 MAP4K1
Type:
PROTEIN
Mol. Mass.:
91316.07
Organism:
Homo sapiens (Human)
Description:
ChEMBL_586597
Residue:
833
  
Inhibitor
Name:
BDBM500610
Synonyms:
2-(4-(7-((5-(4- methylpiperazin- 1-yl)pyridin- 2-yl)amino)-1- oxoisoindolin- 4-yl)-lH- pyrrolo[2.3- b]pyridin-1- yl)acctamide US11078201, Compound I-269 | US11548890, Compound I-269
Type:
Small organic molecule
Emp. Form.:
C27H28N8O2
Mol. Mass.:
496.5636
SMILES:
CN1CCN(CC1)c1ccc(Nc2ccc(c3CNC(=O)c23)-c2ccnc3n(CC(N)=O)ccc23)nc1
: